QwQ

6 jobs for !31 with qwq in 6 minutes and 34 seconds (queued for 2 minutes and 32 seconds)
latest detached
Status Name Job ID Coverage
  Run
passed gruppen: [1, Firmwehr/gentle, 1] #528635
alive

00:01:30

failed gruppen: [2, compilerpraktikum/compiler, 0] #528636
alive

00:01:17

failed gruppen: [3, larsk21/compiler-minijava, 0] #528637
alive

00:00:35

failed gruppen: [4, iComputerfreak/DerCompiler, 0] #528638
alive

00:00:53

failed gruppen: [5, CompPrakt21/Compiler, 0] #528639
alive

00:00:23

passed linter #528634
alive

00:04:42

 
Name Stage Failure
failed
gruppen: [5, CompPrakt21/Compiler, 0] Run
[ERROR] 
[ERROR] To see the full stack trace of the errors, re-run Maven with the -e switch.
[ERROR] Re-run Maven using the -X switch to enable full debug logging.
[ERROR]
[ERROR] For more information about the errors and possible solutions, please read the following articles:
[ERROR] [Help 1] http://cwiki.apache.org/confluence/display/MAVEN/MojoFailureException
Running after_script
Uploading artifacts for failed job
ERROR: Job failed: exit code 1
failed
gruppen: [4, iComputerfreak/DerCompiler, 0] Run



----------------------------------------
Ran 38 tests, of which 3 failed.
A full report for each test can be found at ../../../mjtest/reports/12-11-21_21-08-19_ast.failed
Ran 145 tests, of which 12 failed.
Uploading artifacts for failed job
ERROR: Job failed: exit code 1
failed
gruppen: [3, larsk21/compiler-minijava, 0] Run
[0474]            } else
[0475] ;
[0476]
[0477] memphisGabelleCracticus();
[0478] gingivitis(null, null, null, null, sprawledPhaeophyceae);
[0479] int[][] persiflage = null;
[0480] return new int[persiflage[persiflage[persiflage[-151205649][-218779302] = persiflage[-810269384][740033800] * persiflage[-1782991120 % -1989104154][-1755409593]][persiflage[(((208052204 - persiflage[125356312][1552454149]) - persiflage[947071322][-674084546]) - persiflage[1052736142 - -580408419][-2085963062]) + persiflage[-625611324][-562433852 - (-477154332 * 113922562)]][-1006084957 % 1046281700] = persiflage[-230042573][2138271316 * -898052136] / -351366045] / persiflage[1646046515][persiflage[311989603 * -752508955][persiflage[1023300686][938157661 * 410836925] = -1399067811 + 884417384] = persiflage[-694
Running after_script
Uploading artifacts for failed job
ERROR: Job failed: exit code 1
failed
gruppen: [2, compilerpraktikum/compiler, 0] Run


----------------------------------------
Ran 38 tests, of which 38 failed.
A full report for each test can be found at ../../../mjtest/reports/12-11-21_21-06-43_ast.failed
Ran 145 tests, of which 47 failed.
Running after_script
Uploading artifacts for failed job
ERROR: Job failed: exit code 1