Fix trailing newlines and 1 invalid test

6 jobs for !38 with DerCompiler in 8 minutes and 58 seconds (queued for 6 seconds)
latest detached
Status Name Job ID Coverage
  Run
passed gruppen: [1, Firmwehr/gentle, 1] #532931
alive

00:02:32

failed gruppen: [2, compilerpraktikum/compiler, 1] #532932
alive

00:04:06

failed gruppen: [3, larsk21/compiler-minijava, 1] #532933
alive

00:02:07

failed gruppen: [4, iComputerfreak/DerCompiler, 1] #532934
alive

00:01:33

failed gruppen: [5, CompPrakt21/Compiler, 0] #532935
alive

00:00:21

passed linter #532930
alive

00:02:49

 
Name Stage Failure
failed
gruppen: [5, CompPrakt21/Compiler, 0] Run
[ERROR] -> [Help 1]
[ERROR]
[ERROR] To see the full stack trace of the errors, re-run Maven with the -e switch.
[ERROR] Re-run Maven using the -X switch to enable full debug logging.
[ERROR]
[ERROR] For more information about the errors and possible solutions, please read the following articles:
[ERROR] [Help 1] http://cwiki.apache.org/confluence/display/MAVEN/MojoFailureException
Cleaning up project directory and file based variables
ERROR: Job failed: exit code 1

failed
gruppen: [4, iComputerfreak/DerCompiler, 1] Run
[SUCCESS] semantic:WriteBoolean.invalid.mj        correct
[SUCCESS] semantic:WrongArrayAccess.invalid.mj correct
[SUCCESS] semantic:WrongReturnValue.invalid.mj correct
----------------------------------------
Ran 113 tests, of which 32 failed.
A full report for each test can be found at ../../../mjtest/reports/20-11-21_15-16-36_semantic.failed
Ran 258 tests, of which 32 failed.
Cleaning up project directory and file based variables
ERROR: Job failed: exit code 1

failed
gruppen: [3, larsk21/compiler-minijava, 1] Run
[SUCCESS] semantic:WriteBoolean.invalid.mj        correct
[SUCCESS] semantic:WrongArrayAccess.invalid.mj correct
[SUCCESS] semantic:WrongReturnValue.invalid.mj correct
----------------------------------------
Ran 113 tests, of which 1 failed.
A full report for each test can be found at ../../../mjtest/reports/20-11-21_15-14-47_semantic.failed
Ran 258 tests, of which 1 failed.
Cleaning up project directory and file based variables
ERROR: Job failed: exit code 1

failed
gruppen: [2, compilerpraktikum/compiler, 1] Run



----------------------------------------
Ran 113 tests, of which 74 failed.
A full report for each test can be found at ../../../mjtest/reports/20-11-21_15-13-28_semantic.failed
Ran 258 tests, of which 74 failed.
Cleaning up project directory and file based variables
ERROR: Job failed: exit code 1