7 jobs for !42 with exec/gruppe1 in 15 minutes and 14 seconds (queued for 5 seconds)
detached
Status Name Job ID Coverage
  Run
failed gruppen: [1, Firmwehr/gentle, 1] #537691
alive

00:03:20

failed gruppen: [2, compilerpraktikum/compiler, 1] #537692
alive

00:05:44

failed gruppen: [3, larsk21/compiler-minijava, 1] #537693
alive

00:00:46

failed gruppen: [4, iComputerfreak/DerCompiler, 1] #537694
alive

00:03:25

failed gruppen: [5, CompPrakt21/Compiler, 0] #538088
alive

00:05:35

passed linter #537690
alive

00:02:57

failed gruppen: [5, CompPrakt21/Compiler, 0] #537695
alive

00:03:30

 
Name Stage Failure
failed
gruppen: [5, CompPrakt21/Compiler, 0] Run
[0107]    }
[0108]

----------------------------------------
Ran 7 tests, of which 7 failed.
A full report for each test can be found at ../../../mjtest/reports/29-11-21_14-36-44_compile.failed
Ran 374 tests, of which 7 failed.
Cleaning up project directory and file based variables
ERROR: Job failed: exit code 1

failed
gruppen: [4, iComputerfreak/DerCompiler, 1] Run
[0107]    }
[0108]

----------------------------------------
Ran 7 tests, of which 7 failed.
A full report for each test can be found at ../../../mjtest/reports/28-11-21_19-47-27_compile.failed
Ran 374 tests, of which 8 failed.
Cleaning up project directory and file based variables
ERROR: Job failed: exit code 1

failed
gruppen: [2, compilerpraktikum/compiler, 1] Run
[0144]    +[-[->>>>>>>>>+<<<<<<<<<]>>>>>>>>>]>>>>>->>>>>>>>>>>>>>>>>>>>>>>>>>>-<<<<<<[<<<<
[0145] <<<<<]]>>>]

----------------------------------------
Ran 7 tests, of which 7 failed.
A full report for each test can be found at ../../../mjtest/reports/28-11-21_19-45-45_compile.failed
Ran 374 tests, of which 7 failed.
Cleaning up project directory and file based variables
ERROR: Job failed: exit code 1

failed
gruppen: [3, larsk21/compiler-minijava, 1] Run
[ERROR] -> [Help 1]
[ERROR]
[ERROR] To see the full stack trace of the errors, re-run Maven with the -e switch.
[ERROR] Re-run Maven using the -X switch to enable full debug logging.
[ERROR]
[ERROR] For more information about the errors and possible solutions, please read the following articles:
[ERROR] [Help 1] http://cwiki.apache.org/confluence/display/MAVEN/MojoFailureException
Cleaning up project directory and file based variables
ERROR: Job failed: exit code 1

failed
gruppen: [1, Firmwehr/gentle, 1] Run
[0107]    }
[0108]

----------------------------------------
Ran 7 tests, of which 7 failed.
A full report for each test can be found at ../../../mjtest/reports/28-11-21_19-42-35_compile.failed
Ran 374 tests, of which 7 failed.
Cleaning up project directory and file based variables
ERROR: Job failed: exit code 1