Use correct Testcase

6 jobs for !43 with gruppe2/exec in 13 minutes and 40 seconds (queued for 7 seconds)
detached
Status Name Job ID Coverage
  Run
passed gruppen: [1, Firmwehr/gentle, 1] #537750
alive

00:04:04

passed gruppen: [2, compilerpraktikum/compiler, 1] #537751
alive

00:06:07

failed gruppen: [3, larsk21/compiler-minijava, 1] #537752
alive

00:00:37

failed gruppen: [4, iComputerfreak/DerCompiler, 1] #537753
alive

00:02:43

passed gruppen: [5, CompPrakt21/Compiler, 0] #537754
alive

00:04:30

failed linter #537749
alive

00:00:46

 
Name Stage Failure
failed
gruppen: [4, iComputerfreak/DerCompiler, 1] Run
[SUCCESS] semantic:WrongMainParameter.invalid.mj  correct
[SUCCESS] semantic:WrongReturnValue.invalid.mj correct
[SUCCESS] semantic:WrongScope.invalid.mj correct
----------------------------------------
Ran 221 tests, of which 1 failed.
A full report for each test can be found at ../../../mjtest/reports/28-11-21_22-07-58_semantic.failed
Ran 369 tests, of which 1 failed.
Cleaning up project directory and file based variables
ERROR: Job failed: exit code 1

failed
gruppen: [3, larsk21/compiler-minijava, 1] Run
[ERROR] -> [Help 1]
[ERROR]
[ERROR] To see the full stack trace of the errors, re-run Maven with the -e switch.
[ERROR] Re-run Maven using the -X switch to enable full debug logging.
[ERROR]
[ERROR] For more information about the errors and possible solutions, please read the following articles:
[ERROR] [Help 1] http://cwiki.apache.org/confluence/display/MAVEN/MojoFailureException
Cleaning up project directory and file based variables
ERROR: Job failed: exit code 1

failed
linter Run
### Checking whether nonempty files have a trailing newline...
[!] Problems found:
[*] semantic/WrongScope.invalid.mj does not have a trailing newline
### Checking whether a valid test file exists for every .out file... passed
### Checking whether .out files have no trailing whitespace at the end of each line... passed
# Linting is done
[!] 1 problems found! Reporting them using exit code.
Cleaning up project directory and file based variables
ERROR: Job failed: exit code 1