Add negative integer literals in precarious situations

6 jobs for !44 with negation in 14 minutes and 21 seconds (queued for 5 seconds)
latest detached
Status Name Job ID Coverage
  Run
passed gruppen: [1, Firmwehr/gentle, 1] #538036
alive

00:04:35

passed gruppen: [2, compilerpraktikum/compiler, 1] #538037
alive

00:05:41

failed gruppen: [3, larsk21/compiler-minijava, 1] #538038
alive

00:00:44

failed gruppen: [4, iComputerfreak/DerCompiler, 1] #538039
alive

00:02:58

failed gruppen: [5, CompPrakt21/Compiler, 0] #538040
alive

00:03:52

passed linter #538035
alive

00:03:02

 
Name Stage Failure
failed
gruppen: [5, CompPrakt21/Compiler, 0] Run
[SUCCESS] semantic:WriteBoolean.invalid.mj        correct
[SUCCESS] semantic:WrongArrayAccess.invalid.mj correct
[SUCCESS] semantic:WrongMainParameter.invalid.mj correct
[SUCCESS] semantic:WrongReturnValue.invalid.mj correct
----------------------------------------
All 219 run tests succeeded
Ran 369 tests, of which 2 failed.
Cleaning up project directory and file based variables
ERROR: Job failed: exit code 1

failed
gruppen: [4, iComputerfreak/DerCompiler, 1] Run
[SUCCESS] semantic:WrongArrayAccess.invalid.mj    correct
[SUCCESS] semantic:WrongMainParameter.invalid.mj correct
[SUCCESS] semantic:WrongReturnValue.invalid.mj correct
----------------------------------------
Ran 219 tests, of which 1 failed.
A full report for each test can be found at ../../../mjtest/reports/29-11-21_14-12-49_semantic.failed
Ran 369 tests, of which 1 failed.
Cleaning up project directory and file based variables
ERROR: Job failed: exit code 1

failed
gruppen: [3, larsk21/compiler-minijava, 1] Run
[ERROR] -> [Help 1]
[ERROR]
[ERROR] To see the full stack trace of the errors, re-run Maven with the -e switch.
[ERROR] Re-run Maven using the -X switch to enable full debug logging.
[ERROR]
[ERROR] For more information about the errors and possible solutions, please read the following articles:
[ERROR] [Help 1] http://cwiki.apache.org/confluence/display/MAVEN/MojoFailureException
Cleaning up project directory and file based variables
ERROR: Job failed: exit code 1