Add another big raytracer test

6 jobs for !42 with exec/gruppe1 in 12 minutes and 44 seconds (queued for 8 seconds)
latest merge request
Name Stage Failure
failed
gruppen: [5, CompPrakt21/Compiler, 0] Run
[0501]    }
[0502]

----------------------------------------
Ran 8 tests, of which 8 failed.
A full report for each test can be found at ../../../mjtest/reports/04-12-21_16-12-44_compile-firm.failed
Ran 375 tests, of which 8 failed.
Cleaning up project directory and file based variables
ERROR: Job failed: exit code 1

failed
gruppen: [4, iComputerfreak/DerCompiler, 1] Run
[0501]    }
[0502]

----------------------------------------
Ran 8 tests, of which 8 failed.
A full report for each test can be found at ../../../mjtest/reports/04-12-21_16-11-24_compile-firm.failed
Ran 375 tests, of which 8 failed.
Cleaning up project directory and file based variables
ERROR: Job failed: exit code 1

failed
gruppen: [2, compilerpraktikum/compiler, 1] Run
[0008]    TVF-5#2#F-3#2#F2#1#VF0#1#F-3#2#F9#2#VF0#1#F5#2#F9#2#C44#62#80#
[0009] TVF5#2#F-3#2#F2#1#VF0#1#F-3#2#F9#2#VF0#1#F5#2#F9#2#C52#73#94#

----------------------------------------
Ran 8 tests, of which 8 failed.
A full report for each test can be found at ../../../mjtest/reports/04-12-21_16-08-22_compile-firm.failed
Ran 375 tests, of which 8 failed.
Cleaning up project directory and file based variables
ERROR: Job failed: exit code 1

failed
gruppen: [3, larsk21/compiler-minijava, 1] Run
[ERROR] -> [Help 1]
[ERROR]
[ERROR] To see the full stack trace of the errors, re-run Maven with the -e switch.
[ERROR] Re-run Maven using the -X switch to enable full debug logging.
[ERROR]
[ERROR] For more information about the errors and possible solutions, please read the following articles:
[ERROR] [Help 1] http://cwiki.apache.org/confluence/display/MAVEN/MojoFailureException
Cleaning up project directory and file based variables
ERROR: Job failed: exit code 1