Add missing trailing newlines, delete extra file

6 jobs for !43 with gruppe2/exec in 12 minutes and 52 seconds (queued for 4 minutes and 23 seconds)
latest merge request
Name Stage Failure
failed
gruppen: [5, CompPrakt21/Compiler, 0] Run
[0020]    }
[0021]

----------------------------------------
Ran 13 tests, of which 13 failed.
A full report for each test can be found at ../../../mjtest/reports/04-12-21_16-49-18_compile-firm.failed
Ran 384 tests, of which 15 failed.
Cleaning up project directory and file based variables
ERROR: Job failed: exit code 1

failed
gruppen: [4, iComputerfreak/DerCompiler, 1] Run
[0020]    }
[0021]

----------------------------------------
Ran 13 tests, of which 13 failed.
A full report for each test can be found at ../../../mjtest/reports/04-12-21_16-47-45_compile-firm.failed
Ran 384 tests, of which 13 failed.
Cleaning up project directory and file based variables
ERROR: Job failed: exit code 1

failed
gruppen: [2, compilerpraktikum/compiler, 1] Run
[0020]    }
[0021]

----------------------------------------
Ran 13 tests, of which 13 failed.
A full report for each test can be found at ../../../mjtest/reports/04-12-21_16-44-29_compile-firm.failed
Ran 384 tests, of which 13 failed.
Cleaning up project directory and file based variables
ERROR: Job failed: exit code 1

failed
gruppen: [3, larsk21/compiler-minijava, 1] Run
[ERROR] -> [Help 1]
[ERROR]
[ERROR] To see the full stack trace of the errors, re-run Maven with the -e switch.
[ERROR] Re-run Maven using the -X switch to enable full debug logging.
[ERROR]
[ERROR] For more information about the errors and possible solutions, please read the following articles:
[ERROR] [Help 1] http://cwiki.apache.org/confluence/display/MAVEN/MojoFailureException
Cleaning up project directory and file based variables
ERROR: Job failed: exit code 1