Move kit logo test to big

8 jobs for !46 with exec/gruppe1 in 18 minutes and 53 seconds (queued for 8 seconds)
latest merge request
Name Stage Failure
failed
gruppen: [2, compilerpraktikum/compiler, 1] Run
[0020]    }
[0021]

----------------------------------------
Ran 26 tests, of which 26 failed.
A full report for each test can be found at ../../../mjtest/reports/06-12-21_03-17-26_compile-firm.failed
Ran 397 tests, of which 26 failed.
Cleaning up project directory and file based variables
ERROR: Job failed: exit code 1

failed
gruppen: [5, CompPrakt21/Compiler, 0] Run

[SUCCESS] compile-firm:ReallyEfficientFactorization.java correct
[SUCCESS] compile-firm:TestOverflow.java correct
----------------------------------------
Ran 26 tests, of which 2 failed.
A full report for each test can be found at ../../../mjtest/reports/05-12-21_17-42-43_compile-firm.failed
Ran 397 tests, of which 4 failed.
Cleaning up project directory and file based variables
ERROR: Job failed: exit code 1

failed
gruppen: [4, iComputerfreak/DerCompiler, 1] Run
[0020]    }
[0021]

----------------------------------------
Ran 26 tests, of which 26 failed.
A full report for each test can be found at ../../../mjtest/reports/05-12-21_15-19-56_compile-firm.failed
Ran 397 tests, of which 26 failed.
Cleaning up project directory and file based variables
ERROR: Job failed: exit code 1

failed
gruppen: [3, larsk21/compiler-minijava, 1] Run
[ERROR] -> [Help 1]
[ERROR]
[ERROR] To see the full stack trace of the errors, re-run Maven with the -e switch.
[ERROR] Re-run Maven using the -X switch to enable full debug logging.
[ERROR]
[ERROR] For more information about the errors and possible solutions, please read the following articles:
[ERROR] [Help 1] http://cwiki.apache.org/confluence/display/MAVEN/MojoFailureException
Cleaning up project directory and file based variables
ERROR: Job failed: exit code 1