Merge branch 'fix/backstab' into 'master'

Remove broken Ackerman.inf.java test

See merge request !50
6 jobs for master in 20 minutes and 17 seconds (queued for 5 seconds)
Name Stage Failure
failed
gruppen: [4, iComputerfreak/DerCompiler, 1] Run
Ran 39 tests, of which 35 failed.
A full report for each test can be found at ../../../mjtest/reports/16-12-21_14-08-52_compile-firm.failed
Ran 410 tests, of which 35 failed.



Editing issue 5
Cleaning up project directory and file based variables
ERROR: Job failed: exit code 1

failed
gruppen: [3, larsk21/compiler-minijava, 1] Run
[ERROR] -> [Help 1]
[ERROR]
[ERROR] To see the full stack trace of the errors, re-run Maven with the -e switch.
[ERROR] Re-run Maven using the -X switch to enable full debug logging.
[ERROR]
[ERROR] For more information about the errors and possible solutions, please read the following articles:
[ERROR] [Help 1] http://cwiki.apache.org/confluence/display/MAVEN/MojoFailureException
Cleaning up project directory and file based variables
ERROR: Job failed: exit code 1