Add outfile to check correct division output

6 jobs for !53 with exec/critical-div in 16 minutes and 57 seconds (queued for 3 seconds)
latest merge request
Name Stage Failure
failed
gruppen: [5, CompPrakt21/Compiler, 0] Run
[SUCCESS] compile:RecursiveFoo.java                    correct
[SUCCESS] compile:TestAndFoo.java correct
[SUCCESS] compile:TestOverflow.java correct
----------------------------------------
Ran 41 tests, of which 1 failed.
A full report for each test can be found at ../../../mjtest/reports/17-01-22_13-37-41_compile.failed
Ran 453 tests, of which 3 failed.
Cleaning up project directory and file based variables
ERROR: Job failed: exit code 1

failed
gruppen: [4, iComputerfreak/DerCompiler, 1] Run
[SUCCESS] compile:RecursiveFoo.java                    correct
[SUCCESS] compile:TestAndFoo.java correct
[SUCCESS] compile:TestOverflow.java correct
----------------------------------------
Ran 41 tests, of which 2 failed.
A full report for each test can be found at ../../../mjtest/reports/17-01-22_13-36-20_compile.failed
Ran 453 tests, of which 3 failed.
Cleaning up project directory and file based variables
ERROR: Job failed: exit code 1

failed
gruppen: [2, compilerpraktikum/compiler, 1] Run
[0020]    }
[0021]

----------------------------------------
Ran 41 tests, of which 41 failed.
A full report for each test can be found at ../../../mjtest/reports/17-01-22_13-31-37_compile.failed
Ran 453 tests, of which 43 failed.
Cleaning up project directory and file based variables
ERROR: Job failed: exit code 1

failed
gruppen: [3, larsk21/compiler-minijava, 1] Run
[ERROR] -> [Help 1]
[ERROR]
[ERROR] To see the full stack trace of the errors, re-run Maven with the -e switch.
[ERROR] Re-run Maven using the -X switch to enable full debug logging.
[ERROR]
[ERROR] For more information about the errors and possible solutions, please read the following articles:
[ERROR] [Help 1] http://cwiki.apache.org/confluence/display/MAVEN/MojoFailureException
Cleaning up project directory and file based variables
ERROR: Job failed: exit code 1