Fix ASCII encoding in exec/Nulls2.java

6 jobs for !63 with fix/exec/null2-ascii-encoding in 26 minutes and 11 seconds (queued for 3 seconds)
latest merge request
Name Stage Failure
failed
gruppen: [4, iComputerfreak/DerCompiler, 1] Run
[SUCCESS] compile:TestOverflow.java                    correct
[SUCCESS] compile:Vector.java correct
[SUCCESS] compile:WhileArraySum.java correct
----------------------------------------
Ran 63 tests, of which 1 failed.
A full report for each test can be found at ../../../mjtest/reports/01-02-22_23-16-40_compile.failed
Ran 644 tests, of which 2 failed.
Cleaning up project directory and file based variables
ERROR: Job failed: exit code 1

failed
gruppen: [3, larsk21/compiler-minijava, 1] Run
[ERROR] -> [Help 1]
[ERROR]
[ERROR] To see the full stack trace of the errors, re-run Maven with the -e switch.
[ERROR] Re-run Maven using the -X switch to enable full debug logging.
[ERROR]
[ERROR] For more information about the errors and possible solutions, please read the following articles:
[ERROR] [Help 1] http://cwiki.apache.org/confluence/display/MAVEN/MojoFailureException
Cleaning up project directory and file based variables
ERROR: Job failed: exit code 1

failed
gruppen: [2, compilerpraktikum/compiler, 1] Run
[0057]    }
[0058]

----------------------------------------
Ran 63 tests, of which 63 failed.
A full report for each test can be found at ../../../mjtest/reports/01-02-22_23-06-06_compile.failed
Ran 644 tests, of which 136 failed.
Cleaning up project directory and file based variables
ERROR: Job failed: exit code 1