Merge branch 'exec/while-with-assignments' into 'master'

Add test with multiple assignments in a while condition

See merge request !64
6 jobs for master in 27 minutes and 10 seconds (queued for 19 minutes and 55 seconds)
Name Stage Failure
failed
gruppen: [4, iComputerfreak/DerCompiler, 1] Run
Ran 64 tests, of which 1 failed.
A full report for each test can be found at ../../../mjtest/reports/02-02-22_19-27-19_compile.failed
Ran 646 tests, of which 2 failed.



Editing issue 5
Cleaning up project directory and file based variables
ERROR: Job failed: exit code 1

failed
gruppen: [3, larsk21/compiler-minijava, 1] Run
[ERROR] -> [Help 1]
[ERROR]
[ERROR] To see the full stack trace of the errors, re-run Maven with the -e switch.
[ERROR] Re-run Maven using the -X switch to enable full debug logging.
[ERROR]
[ERROR] For more information about the errors and possible solutions, please read the following articles:
[ERROR] [Help 1] http://cwiki.apache.org/confluence/display/MAVEN/MojoFailureException
Cleaning up project directory and file based variables
ERROR: Job failed: exit code 1

failed
gruppen: [2, compilerpraktikum/compiler, 1] Run
Ran 64 tests, of which 64 failed.
A full report for each test can be found at ../../../mjtest/reports/02-02-22_19-16-34_compile.failed
Ran 646 tests, of which 137 failed.



Editing issue 63
Cleaning up project directory and file based variables
ERROR: Job failed: exit code 1