Add test case for return in nested block

10 jobs for !66 with exec/nested-return in 45 minutes and 28 seconds (queued for 1 second)
latest merge request
Name Stage Failure
failed
gruppen: [4, iComputerfreak/DerCompiler, 1] Run

[SUCCESS] compile:WhileArraySum.java correct
[SUCCESS] compile:WhileWithAssignments.java correct
----------------------------------------
Ran 65 tests, of which 20 failed.
A full report for each test can be found at ../../../mjtest/reports/07-02-22_23-05-31_compile.failed
Ran 648 tests, of which 21 failed.
Cleaning up project directory and file based variables
ERROR: Job failed: exit code 1

failed
gruppen: [3, larsk21/compiler-minijava, 1] Run
[ERROR] -> [Help 1]
[ERROR]
[ERROR] To see the full stack trace of the errors, re-run Maven with the -e switch.
[ERROR] Re-run Maven using the -X switch to enable full debug logging.
[ERROR]
[ERROR] For more information about the errors and possible solutions, please read the following articles:
[ERROR] [Help 1] http://cwiki.apache.org/confluence/display/MAVEN/MojoFailureException
Cleaning up project directory and file based variables
ERROR: Job failed: exit code 1