Merge branch 'exec/nested-return' into 'master'

Add test case for return in nested block

See merge request !66
6 jobs for master in 31 minutes and 23 seconds (queued for 32 seconds)
latest
Name Stage Failure
failed
gruppen: [4, iComputerfreak/DerCompiler, 1] Run
Ran 65 tests, of which 19 failed.
A full report for each test can be found at ../../../mjtest/reports/08-02-22_13-26-11_compile.failed
Ran 648 tests, of which 20 failed.



Editing issue 5
Cleaning up project directory and file based variables
ERROR: Job failed: exit code 1

failed
gruppen: [3, larsk21/compiler-minijava, 1] Run
[ERROR] -> [Help 1]
[ERROR]
[ERROR] To see the full stack trace of the errors, re-run Maven with the -e switch.
[ERROR] Re-run Maven using the -X switch to enable full debug logging.
[ERROR]
[ERROR] For more information about the errors and possible solutions, please read the following articles:
[ERROR] [Help 1] http://cwiki.apache.org/confluence/display/MAVEN/MojoFailureException
Cleaning up project directory and file based variables
ERROR: Job failed: exit code 1