adaption to 165

4 jobs for feature in 8 minutes (queued for 2 seconds)
Status Job ID Name Coverage
  Build
failed #327323
shell
build-mlmc

00:07:59

 
  Test
skipped #327330
docker
mpi-test-mlmc
skipped #327327
docker
unit-test-mlmc
 
  .Post
failed #327332
shell allowed to fail
clean-mlmc

00:00:00

 
Name Stage Failure
failed
clean-mlmc .Post
Getting source from Git repository
Skipping Git repository setup
Skipping Git checkout
Skipping Git submodules setup
Executing "step_script" stage of the job script
$ docker rmi ${REGISTRY}/${IMAGE_NAME_MLMC}
Error: No such image: ci.cluster.math.kit.edu/mlmc-c0656fe1-ubuntu20.04
Cleaning up file based variables
ERROR: Job failed: exit status 1
failed
build-mlmc Build
/usr/bin/ld: /mpp/mpp/googletest/googletest/include/gtest/internal/gtest-port.h:1092: undefined reference to `testing::internal::GTestLog::~GTestLog()'
/usr/bin/ld: /mpp/mpp/googletest/googletest/include/gtest/internal/gtest-port.h:1092:
undefined reference to `testing::internal::GTestLog::~GTestLog()'
collect2: error: ld returned 1 exit status
make[2]: *** [mlmc/tests/CMakeFiles/TestMain.dir/build.make:103: mlmc/tests/TestMain] Error 1
make[1]: *** [CMakeFiles/Makefile2:1523: mlmc/tests/CMakeFiles/TestMain.dir/all] Error 2
make: *** [Makefile:141: all] Error 2
The command '/bin/sh -c tar xjf sprng5.tar.bz2 && cd sprng5 && ./configure --with-mpi=yes --with-fortran=no && make -j20 && cd .. && cd mpp && git fetch --all && git checkout $UPSTREAM_COMMIT && cd .. && mkdir -p build && cd build && cmake .. && make -j' returned a non-zero code: 2
Cleaning up file based variables
ERROR: Job failed: exit status 1