bug fix flux gen. flux gen is not working yet

4 jobs for feature in 8 minutes and 16 seconds (queued for 3 seconds)
Status Job ID Name Coverage
  Build
failed #367394
shell
build-mlmc

00:08:16

 
  Test
skipped #367399
docker
ctest-mlmc
skipped #367404
docker
mpitest-mlmc
 
  .Post
failed #367409
shell allowed to fail
clean-mlmc

00:00:00

 
Name Stage Failure
failed
clean-mlmc .Post
Getting source from Git repository
Skipping Git repository setup
Skipping Git checkout
Skipping Git submodules setup
Executing "step_script" stage of the job script
$ docker rmi ${REGISTRY}/${IMAGE_NAME_MLMC}
Error: No such image: ci.cluster.math.kit.edu/mlmc-b0b95502-ubuntu20.04-131993
Cleaning up file based variables
ERROR: Job failed: exit status 1
failed
build-mlmc Build
make[2]: *** Waiting for unfinished jobs....
make[2]: *** [mlmc/src/pdesolver/CMakeFiles/PDESOLVER.dir/build.make:63: mlmc/src/pdesolver/CMakeFiles/PDESOLVER.dir/PDESolver.cpp.o] Error 1
[ 80%] Linking CXX executable TestLevel
[ 80%] Built target TestLevel
make[1]: *** [CMakeFiles/Makefile2:1150: mlmc/src/pdesolver/CMakeFiles/PDESOLVER.dir/all] Error 2
make: *** [Makefile:141: all] Error 2
The command '/bin/sh -c tar xjf sprng5.tar.bz2 && cd sprng5 && ./configure --with-mpi=yes --with-fortran=no && make -j20 && cd .. && cd mpp && git fetch --all && git checkout $UPSTREAM_COMMIT && cd .. && mkdir -p build && cd build && cmake .. && make -j' returned a non-zero code: 2
Cleaning up file based variables
ERROR: Job failed: exit status 1