Merge branch 'refactor-smallmatrix' into 'feature'

Refactor smallmatrix

See merge request !7
4 jobs for feature in 9 minutes and 52 seconds (queued for 4 seconds)
Status Job ID Name Coverage
  Build
failed #386788
shell
build-mlmc

00:09:51

 
  Test
skipped #386793
docker
ctest-mlmc
skipped #386797
docker
mpitest-mlmc
 
  .Post
failed #386801
shell allowed to fail
clean-mlmc

00:00:00

 
Name Stage Failure
failed
clean-mlmc .Post
Getting source from Git repository
Skipping Git repository setup
Skipping Git checkout
Skipping Git submodules setup
Executing "step_script" stage of the job script
$ docker rmi ${REGISTRY}/${IMAGE_NAME_MLMC}
Error: No such image: ci.cluster.math.kit.edu/mlmc-ccbd5a27-ubuntu20.04-137502
Cleaning up file based variables
ERROR: Job failed: exit status 1
failed
build-mlmc Build
[ 89%] Built target TestLevel
make[2]: *** [mlmc/tests/CMakeFiles/TestPlotMap.dir/build.make:63: mlmc/tests/CMakeFiles/TestPlotMap.dir/basics/TestPlotMap.cpp.o] Error 1
make[1]: *** [CMakeFiles/Makefile2:2170: mlmc/tests/CMakeFiles/TestPlotMap.dir/all] Error 2
make[1]: *** Waiting for unfinished jobs....
make[1]: *** [CMakeFiles/Makefile2:1958: mlmc/src/pdesolver/CMakeFiles/PDESOLVER.dir/all] Error 2
make: *** [Makefile:141: all] Error 2
The command '/bin/sh -c tar xjf sprng5.tar.bz2 && cd sprng5 && ./configure --with-mpi=yes --with-fortran=no && make -j20 && cd .. && cd mpp && git fetch --all && git checkout $UPSTREAM_COMMIT && cd .. && mkdir -p build && cd build && cmake .. && make -j' returned a non-zero code: 2
Cleaning up file based variables
ERROR: Job failed: exit status 1