Merge branch 'adapt-249' into 'feature'

Adapt 249

See merge request mpp/mlmc!24
5 jobs for feature in 10 minutes and 20 seconds (queued for 2 seconds)
Status Name Job ID Coverage
  Build
failed build-mlmc #426726
shell

00:10:19

 
  Test
skipped ctest-mlmc #426729
docker
skipped mpitest-mlmc #426732
docker
 
  Experiments
skipped elliptic-exercises-mlmc #426737
docker
 
  .Post
failed clean-mlmc #426741
shell allowed to fail

00:00:00

 
Name Stage Failure
failed
clean-mlmc .Post
Getting source from Git repository
Skipping Git repository setup
Skipping Git checkout
Skipping Git submodules setup
Executing "step_script" stage of the job script
$ docker rmi ${REGISTRY}/${IMAGE_NAME_MLMC}
Error: No such image: ci.cluster.math.kit.edu/mlmc-c02f0403-ubuntu20.04-148252
Cleaning up file based variables
ERROR: Job failed: exit status 1
failed
build-mlmc Build
make[2]: *** [mlmc/src/pdesolver/CMakeFiles/PDESOLVER.dir/build.make:63: mlmc/src/pdesolver/CMakeFiles/PDESOLVER.dir/PDESolver.cpp.o] Error 1
make[1]: *** [CMakeFiles/Makefile2:1958: mlmc/src/pdesolver/CMakeFiles/PDESOLVER.dir/all] Error 2
make[1]: *** Waiting for unfinished jobs....
[ 88%] Linking CXX executable TestPlotting
[ 88%] Built target TestPlotting
make: *** [Makefile:141: all] Error 2
The command '/bin/sh -c tar xjf sprng5.tar.bz2 && cd sprng5 && ./configure --with-mpi=yes --with-fortran=no && make -j20 && cd .. && cd mpp && git fetch --all && git checkout $UPSTREAM_COMMIT && cd .. && mkdir -p build && cd build && cmake .. && make -j' returned a non-zero code: 2
Cleaning up file based variables
ERROR: Job failed: exit status 1