Merge branch '19-develop-new-test-problem' into 'feature'

Resolve "Develop new Test Problem"

Closes #19

See merge request mpp/mlmc!26
6 jobs for feature in 9 minutes and 48 seconds (queued for 4 seconds)
Status Job ID Name Coverage
  Build
failed build-mlmc #427589
shell

00:09:47

 
  Test
skipped ctest-mlmc #427591
docker
skipped mpitest-mlmc #427593
docker
 
  Experiments
skipped elliptic-experiments-mlmc #427597
docker
skipped elliptic-experiments-mlmc2 #427602
docker
 
  .Post
failed clean-mlmc #427607
shell allowed to fail

00:00:01

 
Name Stage Failure
failed
build-mlmc Build
make[2]: *** [mlmc/src/pdesolver/CMakeFiles/PDESOLVER.dir/build.make:63: mlmc/src/pdesolver/CMakeFiles/PDESOLVER.dir/PDESolverCreator.cpp.o] Error 1
make[1]: *** [CMakeFiles/Makefile2:1960: mlmc/src/pdesolver/CMakeFiles/PDESOLVER.dir/all] Error 2
make[1]: *** Waiting for unfinished jobs....
[ 88%] Linking CXX executable TestPlotting
[ 88%] Built target TestPlotting
make: *** [Makefile:141: all] Error 2
The command '/bin/sh -c tar xjf sprng5.tar.bz2 && cd sprng5 && ./configure --with-mpi=yes --with-fortran=no && make -j20 && cd .. && cd mpp && git fetch --all && git checkout $UPSTREAM_COMMIT && cd .. && mkdir -p build && cd build && cmake .. && make -j' returned a non-zero code: 2
Cleaning up file based variables
ERROR: Job failed: exit status 1
failed
clean-mlmc .Post
Getting source from Git repository
Skipping Git repository setup
Skipping Git checkout
Skipping Git submodules setup
Executing "step_script" stage of the job script
$ docker rmi ${REGISTRY}/${IMAGE_NAME_MLMC}
Error: No such image: ci.cluster.math.kit.edu/mlmc-5ffb5a1e-ubuntu20.04-148465
Cleaning up file based variables
ERROR: Job failed: exit status 1