Merge branch '19-develop-new-test-problem' into 'feature'

Resolve "Develop new Test Problem"

Closes #19

See merge request mpp/mlmc!26
6 jobs for feature in 7 minutes and 29 seconds (queued for 2 seconds)
Status Job ID Name Coverage
  Build
failed build-mlmc #429416
shell

00:07:28

 
  Test
skipped ctest-mlmc #429417
docker
skipped mpitest-mlmc #429418
docker
 
  Experiments
skipped elliptic-experiments-mlmc #429419
docker
skipped elliptic-experiments-mlmc2 #429420
docker
 
  .Post
failed clean-mlmc #429421
shell allowed to fail

00:00:00

 
Name Stage Failure
failed
clean-mlmc .Post
Getting source from Git repository
Skipping Git repository setup
Skipping Git checkout
Skipping Git submodules setup
Executing "step_script" stage of the job script
$ docker rmi ${REGISTRY}/${IMAGE_NAME_MLMC}
Error: No such image: ci.cluster.math.kit.edu/mlmc-5ffb5a1e-ubuntu20.04-148983
Cleaning up file based variables
ERROR: Job failed: exit status 1
failed
build-mlmc Build
make[2]: *** [mlmc/src/pdesolver/CMakeFiles/PDESOLVER.dir/build.make:167: mlmc/src/pdesolver/CMakeFiles/PDESOLVER.dir/assembling/PGReactionAssemble.cpp.o] Error 1
make[2]: *** [mlmc/src/pdesolver/CMakeFiles/PDESOLVER.dir/build.make:180: mlmc/src/pdesolver/CMakeFiles/PDESOLVER.dir/assembling/DGReactionAssemble.cpp.o] Error 1
[ 88%] Linking CXX executable TestPlotting
[ 88%] Built target TestPlotting
make[1]: *** [CMakeFiles/Makefile2:1960: mlmc/src/pdesolver/CMakeFiles/PDESOLVER.dir/all] Error 2
make: *** [Makefile:141: all] Error 2
The command '/bin/sh -c tar xjf sprng5.tar.bz2 && cd sprng5 && ./configure --with-mpi=yes --with-fortran=no && make -j20 && cd .. && cd mpp && git fetch --all && git checkout $UPSTREAM_COMMIT && cd .. && mkdir -p build && cd build && cmake .. && make -j' returned a non-zero code: 2
Cleaning up file based variables
ERROR: Job failed: exit status 1