fixed test for Gauss Hermite rule

4 jobs for 36-further-sc-tests in 7 minutes and 33 seconds (queued for 7 seconds)
Status Job ID Name Coverage
  Build
failed build-mluq #473157
shell

00:07:33

 
  Test
skipped ctest-mluq #473158
docker
skipped mpitest-mluq #473159
docker
 
  .Post
failed clean-mluq #473160
shell allowed to fail

00:00:00

 
Name Stage Failure
failed
clean-mluq .Post
Getting source from Git repository
Skipping Git repository setup
Skipping Git checkout
Skipping Git submodules setup
Executing "step_script" stage of the job script
$ docker rmi ${REGISTRY}/${IMAGE_NAME_MLUQ}
Error: No such image: ci.cluster.math.kit.edu/mluq-c0b6f10a-ubuntu20.04-160453
Cleaning up file based variables
ERROR: Job failed: exit status 1
failed
build-mluq Build
   14 |   virtual VectorField Flux(const Point &x) const = 0;
| ^~~~
make[2]: *** [mluq/src/problems/CMakeFiles/PROBLEMS.dir/build.make:76: mluq/src/problems/CMakeFiles/PROBLEMS.dir/StochasticEllipticProblem.cpp.o] Error 1
make[2]: *** Waiting for unfinished jobs....
make[1]: *** [CMakeFiles/Makefile2:2298: mluq/src/problems/CMakeFiles/PROBLEMS.dir/all] Error 2
make: *** [Makefile:141: all] Error 2
The command '/bin/sh -c tar xjf sprng5.tar.bz2 && cd sprng5 && ./configure --with-mpi=yes --with-fortran=no && make -j20 && cd .. && cd mpp && git config --get remote.origin.fetch && git config remote.origin.fetch "+refs/heads/*:refs/remotes/origin/*" && git config --get remote.origin.fetch && git fetch --all && git checkout $UPSTREAM_COMMIT && cd .. && mkdir -p build && cd build && cmake .. && make -j' returned a non-zero code: 2
Cleaning up file based variables
ERROR: Job failed: exit status 1