bug fix

3 jobs for master in 1 minute and 36 seconds (queued for 1 second)
Status Job ID Name Coverage
  Test
failed build #16799

00:00:31

failed deploy #16801
allowed to fail

00:00:32

failed test #16800

00:00:33

 
Name Stage Failure
failed
deploy Test There is an unknown failure, please try again
[ERROR] location: class edu.kit.formal.gui.controls.ScriptController
[ERROR] -> [Help 1]
[ERROR]
[ERROR] To see the full stack trace of the errors, re-run Maven with the -e switch.
[ERROR] Re-run Maven using the -X switch to enable full debug logging.
[ERROR]
[ERROR] For more information about the errors and possible solutions, please read the following articles:
[ERROR] [Help 1] http://cwiki.apache.org/confluence/display/MAVEN/MojoFailureException
ERROR: Job failed: exit code 1
failed
test Test There is an unknown failure, please try again
[ERROR] location: class edu.kit.formal.gui.controls.ScriptController
[ERROR] -> [Help 1]
[ERROR]
[ERROR] To see the full stack trace of the errors, re-run Maven with the -e switch.
[ERROR] Re-run Maven using the -X switch to enable full debug logging.
[ERROR]
[ERROR] For more information about the errors and possible solutions, please read the following articles:
[ERROR] [Help 1] http://cwiki.apache.org/confluence/display/MAVEN/MojoFailureException
ERROR: Job failed: exit code 1
failed
build Test There is an unknown failure, please try again
[ERROR] location: class edu.kit.formal.gui.controls.ScriptController
[ERROR] -> [Help 1]
[ERROR]
[ERROR] To see the full stack trace of the errors, re-run Maven with the -e switch.
[ERROR] Re-run Maven using the -X switch to enable full debug logging.
[ERROR]
[ERROR] For more information about the errors and possible solutions, please read the following articles:
[ERROR] [Help 1] http://cwiki.apache.org/confluence/display/MAVEN/MojoFailureException
ERROR: Job failed: exit code 1