Merge branch 'master' of git.scc.kit.edu:xt9634/ProofScriptParser

* 'master' of git.scc.kit.edu:xt9634/ProofScriptParser:
  BUGFIX IndexOutOfRange+NullPointerExc
  merge
  Bugfix for emptyMatch on sequent
3 jobs for master in 2 minutes and 37 seconds (queued for 2 seconds)
Status Name Job ID Coverage
  Test
passed build #18385

00:00:36

failed deploy #18387
allowed to fail

00:01:13

failed test #18386

00:00:47

 
Name Stage Failure
failed
deploy Test There is an unknown failure, please try again
[ERROR] Refer to the generated Javadoc files in '/builds/xt9634/ProofScriptParser/target/apidocs' dir.
[ERROR] -> [Help 1]
[ERROR]
[ERROR] To see the full stack trace of the errors, re-run Maven with the -e switch.
[ERROR] Re-run Maven using the -X switch to enable full debug logging.
[ERROR]
[ERROR] For more information about the errors and possible solutions, please read the following articles:
[ERROR] [Help 1] http://cwiki.apache.org/confluence/display/MAVEN/MojoExecutionException
ERROR: Job failed: exit code 1
failed
test Test There is an unknown failure, please try again
[ERROR] Please refer to /builds/xt9634/ProofScriptParser/target/surefire-reports for the individual test results.
[ERROR] -> [Help 1]
[ERROR]
[ERROR] To see the full stack trace of the errors, re-run Maven with the -e switch.
[ERROR] Re-run Maven using the -X switch to enable full debug logging.
[ERROR]
[ERROR] For more information about the errors and possible solutions, please read the following articles:
[ERROR] [Help 1] http://cwiki.apache.org/confluence/display/MAVEN/MojoFailureException
ERROR: Job failed: exit code 1