Gutter

+ close KeY
+ SaveAsScript Dialog
+ pruning savepoint load
5 jobs for luong_workbranch in 3 minutes and 53 seconds (queued for 1 second)
Status Name Job ID Coverage
  Build
failed build:jdk10 #39007
allowed to fail

00:00:42

passed build:jdk8 #39008

00:01:21

failed build:jdk9 #39006
allowed to fail

00:00:45

 
  Test
failed test #39009
allowed to fail

00:00:39

 
  Deploy
failed deploy #39010
allowed to fail

00:00:24

 
Name Stage Failure
failed
deploy Deploy There is an unknown failure, please try again

* Try:
Run with --stacktrace option to get the stack trace. Run with --info or --debug option to get more log output. Run with --scan to get full insights.

* Get more help at https://help.gradle.org

BUILD FAILED in 12s
1 actionable task: 1 executed
ERROR: Job failed: exit code 1
failed
test Test There is an unknown failure, please try again

* Try:
Run with --stacktrace option to get the stack trace. Run with --info or --debug option to get more log output. Run with --scan to get full insights.

* Get more help at https://help.gradle.org

BUILD FAILED in 28s1 actionable task: 1 executed

ERROR: Job failed: exit code 1
failed
build:jdk10 Build There is an unknown failure, please try again

* Try:
Run with --stacktrace option to get the stack trace. Run with --info or --debug option to get more log output. Run with --scan to get full insights.

* Get more help at https://help.gradle.org

BUILD FAILED in 30s
1 actionable task: 1 executed
ERROR: Job failed: exit code 1
failed
build:jdk9 Build There is an unknown failure, please try again

* Try:
Run with --stacktrace option to get the stack trace. Run with --info or --debug option to get more log output. Run with --scan to get full insights.

* Get more help at https://help.gradle.org

BUILD FAILED in 33s
1 actionable task: 1 executed
ERROR: Job failed: exit code 1