whole underline

+ Proof tree
5 jobs for luong_workbranch in 3 minutes and 21 seconds (queued for 2 seconds)
Status Job ID Name Coverage
  Build
failed #39056
allowed to fail
build:jdk10

00:00:37

passed #39057
build:jdk8

00:01:13

failed #39055
allowed to fail
build:jdk9

00:00:44

 
  Test
failed #39058
allowed to fail
test

00:00:23

 
  Deploy
failed #39059
allowed to fail
deploy

00:00:23

 
Name Stage Failure
failed
deploy Deploy There is an unknown failure, please try again

* Try:
Run with --stacktrace option to get the stack trace. Run with --info or --debug option to get more log output. Run with --scan to get full insights.

* Get more help at https://help.gradle.org

BUILD FAILED in 11s
1 actionable task: 1 executed
ERROR: Job failed: exit code 1
failed
test Test There is an unknown failure, please try again

* Try:
Run with --stacktrace option to get the stack trace. Run with --info or --debug option to get more log output. Run with --scan to get full insights.

* Get more help at https://help.gradle.org

BUILD FAILED in 12s
1 actionable task: 1 executed
ERROR: Job failed: exit code 1
failed
build:jdk10 Build There is an unknown failure, please try again

* Try:
Run with --stacktrace option to get the stack trace. Run with --info or --debug option to get more log output. Run with --scan to get full insights.

* Get more help at https://help.gradle.org

BUILD FAILED in 26s
1 actionable task: 1 executed
ERROR: Job failed: exit code 1
failed
build:jdk9 Build There is an unknown failure, please try again

* Try:
Run with --stacktrace option to get the stack trace. Run with --info or --debug option to get more log output. Run with --scan to get full insights.

* Get more help at https://help.gradle.org

BUILD FAILED in 32s
1 actionable task: 1 executed
ERROR: Job failed: exit code 1