INterim State for ScriptTree, structure is build up, now cornercases such as...

INterim State for ScriptTree, structure is build up, now cornercases such as macthing expressions need to be added
5 jobs for grebing_luong_workbranch in 2 minutes and 55 seconds (queued for 1 second)
Status Job ID Name Coverage
  Build
failed #44262
allowed to fail
build:jdk10

00:00:34

passed #44263
build:jdk8

00:01:01

failed #44261
allowed to fail
build:jdk9

00:00:41

 
  Test
failed #44264
allowed to fail
test

00:00:18

 
  Deploy
failed #44265
allowed to fail
deploy

00:00:19

 
Name Stage Failure
failed
deploy Deploy There is an unknown failure, please try again

* Try:
Run with --stacktrace option to get the stack trace. Run with --info or --debug option to get more log output. Run with --scan to get full insights.

* Get more help at https://help.gradle.org

BUILD FAILED in 8s
1 actionable task: 1 executed
ERROR: Job failed: exit code 1
failed
test Test There is an unknown failure, please try again

* Try:
Run with --stacktrace option to get the stack trace. Run with --info or --debug option to get more log output. Run with --scan to get full insights.

* Get more help at https://help.gradle.org

BUILD FAILED in 8s
1 actionable task: 1 executed
ERROR: Job failed: exit code 1
failed
build:jdk10 Build There is an unknown failure, please try again

* Try:
Run with --stacktrace option to get the stack trace. Run with --info or --debug option to get more log output. Run with --scan to get full insights.

* Get more help at https://help.gradle.org

BUILD FAILED in 23s
1 actionable task: 1 executed
ERROR: Job failed: exit code 1
failed
build:jdk9 Build There is an unknown failure, please try again

* Try:
Run with --stacktrace option to get the stack trace. Run with --info or --debug option to get more log output. Run with --scan to get full insights.

* Get more help at https://help.gradle.org

BUILD FAILED in 27s
1 actionable task: 1 executed
ERROR: Job failed: exit code 1