Linkage to last mutator to its parent not set -> last 2 nodes get lost

5 jobs for grebing_luong_workbranch in 2 minutes and 45 seconds (queued for 2 seconds)
Status Job ID Name Coverage
  Build
failed #50208
allowed to fail
build:jdk10

00:00:31

passed #50209
build:jdk8

00:01:00

failed #50207
allowed to fail
build:jdk9

00:00:35

 
  Test
failed #50210
allowed to fail
test

00:00:19

 
  Deploy
failed #50211
allowed to fail
deploy

00:00:19

 
Name Stage Failure
failed
deploy Deploy There is an unknown failure, please try again

* Try:
Run with --stacktrace option to get the stack trace. Run with --info or --debug option to get more log output. Run with --scan to get full insights.

* Get more help at https://help.gradle.org

BUILD FAILED in 9s
1 actionable task: 1 executed
ERROR: Job failed: exit code 1
failed
test Test There is an unknown failure, please try again

* Try:
Run with --stacktrace option to get the stack trace. Run with --info or --debug option to get more log output. Run with --scan to get full insights.

1 actionable task: 1 executed
* Get more help at https://help.gradle.org

BUILD FAILED in 8s
ERROR: Job failed: exit code 1
failed
build:jdk10 Build There is an unknown failure, please try again

* Try:
Run with --stacktrace option to get the stack trace. Run with --info or --debug option to get more log output. Run with --scan to get full insights.

* Get more help at https://help.gradle.org

BUILD FAILED in 21s
1 actionable task: 1 executed
ERROR: Job failed: exit code 1
failed
build:jdk9 Build There is an unknown failure, please try again

* Try:
Run with --stacktrace option to get the stack trace. Run with --info or --debug option to get more log output. Run with --scan to get full insights.

* Get more help at https://help.gradle.org

BUILD FAILED in 25s
1 actionable task: 1 executed
ERROR: Job failed: exit code 1