no script executed bug fixed

5 jobs for grebing_luong_workbranch in 113 minutes and 57 seconds (queued for 2 seconds)
Name Stage Failure
failed
build:jdk10 Build There is an unknown failure, please try again

* Try:
Run with --stacktrace option to get the stack trace. Run with --info or --debug option to get more log output. Run with --scan to get full insights.

* Get more help at https://help.gradle.org

BUILD FAILED in 27s
1 actionable task: 1 executed
ERROR: Job failed: exit code 1
failed
build:jdk9 Build There has been a timeout failure or the job got stuck. Check your timeout limits or try again
No job log
failed
test Test There is an unknown failure, please try again

* Try:
Run with --stacktrace option to get the stack trace. Run with --info or --debug option to get more log output. Run with --scan to get full insights.

* Get more help at https://help.gradle.org

BUILD FAILED in 9s
1 actionable task: 1 executed
ERROR: Job failed: exit code 1
failed
deploy Deploy There is an unknown failure, please try again

* Try:
Run with --stacktrace option to get the stack trace. Run with --info or --debug option to get more log output. Run with --scan to get full insights.

* Get more help at https://help.gradle.org

BUILD FAILED in 9s
1 actionable task: 1 executed
ERROR: Job failed: exit code 1