foreach-end working for not closed goals

branchlabels working in the Maxtriplets Example
defaultcases added to visitor
5 jobs for grebing_luong_workbranch in 4 minutes and 25 seconds
Status Job ID Name Coverage
  Build
failed #59307
allowed to fail
build:jdk10

00:01:10

passed #59308
build:jdk8

00:01:25

failed #59306
allowed to fail
build:jdk9

00:00:54

 
  Test
failed #59309
allowed to fail
test

00:00:21

 
  Deploy
failed #59310
allowed to fail
deploy

00:00:33

 
Name Stage Failure
failed
deploy Deploy There is an unknown failure, please try again

* Try:
Run with --stacktrace option to get the stack trace. Run with --info or --debug option to get more log output. Run with --scan to get full insights.

* Get more help at https://help.gradle.org
1 actionable task: 1 executed

BUILD FAILED in 9s
ERROR: Job failed: exit code 1
failed
test Test There is an unknown failure, please try again

* Try:
Run with --stacktrace option to get the stack trace. Run with --info or --debug option to get more log output. Run with --scan to get full insights.

* Get more help at https://help.gradle.org

BUILD FAILED in 9s
1 actionable task: 1 executed
ERROR: Job failed: exit code 1
failed
build:jdk10 Build There is an unknown failure, please try again

* Try:
Run with --stacktrace option to get the stack trace. Run with --info or --debug option to get more log output. Run with --scan to get full insights.

* Get more help at https://help.gradle.org

BUILD FAILED in 29s
1 actionable task: 1 executed
ERROR: Job failed: exit code 1
failed
build:jdk9 Build There is an unknown failure, please try again

* Try:
Run with --stacktrace option to get the stack trace. Run with --info or --debug option to get more log output. Run with --scan to get full insights.

* Get more help at https://help.gradle.org

BUILD FAILED in 36s
1 actionable task: 1 executed
ERROR: Job failed: exit code 1