PlaceholderNode

TODO: Bugfix foreach and closed goals
5 jobs for grebing_luong_workbranch in 2 minutes and 52 seconds (queued for 1 second)
Status Job ID Name Coverage
  Build
failed #60867
allowed to fail
build:jdk10

00:00:31

passed #60868
build:jdk8

00:01:00

failed #60866
allowed to fail
build:jdk9

00:00:39

 
  Test
failed #60869
allowed to fail
test

00:00:20

 
  Deploy
failed #60870
allowed to fail
deploy

00:00:20

 
Name Stage Failure
failed
deploy Deploy There is an unknown failure, please try again

* Try:
Run with --stacktrace option to get the stack trace. Run with --info or --debug option to get more log output. Run with --scan to get full insights.

* Get more help at https://help.gradle.org

BUILD FAILED in 8s
1 actionable task: 1 executed
ERROR: Job failed: exit code 1
failed
test Test There is an unknown failure, please try again

* Try:
Run with --stacktrace option to get the stack trace. Run with --info or --debug option to get more log output. Run with --scan to get full insights.

* Get more help at https://help.gradle.org

BUILD FAILED in 9s
1 actionable task: 1 executed
ERROR: Job failed: exit code 1
failed
build:jdk10 Build There is an unknown failure, please try again
> Compilation failed; see the compiler error output for details.

* Try:
Run with --stacktrace option to get the stack trace. Run with --info or --debug option to get more log output. Run with --scan to get full insights.

* Get more help at https://help.gradle.org

BUILD FAILED in 22s
ERROR: Job failed: exit code 1
failed
build:jdk9 Build There is an unknown failure, please try again

* Try:
Run with --stacktrace option to get the stack trace. Run with --info or --debug option to get more log output. Run with --scan to get full insights.

* Get more help at https://help.gradle.org

BUILD FAILED in 29s
1 actionable task: 1 executed
ERROR: Job failed: exit code 1