added psdbg sub folder in temp

5 jobs for luong_mastermerge in 114 minutes and 55 seconds (queued for 2 seconds)
Status Job ID Name Coverage
  Build
failed build:jdk10 #68216
allowed to fail

00:00:36

passed build:jdk8 #68217

00:00:59

failed build:jdk9 #68215
allowed to fail

01:53:46

 
  Test
failed test #68218
allowed to fail

00:00:36

 
  Deploy
failed deploy #68219
allowed to fail

00:00:33

 
Name Stage Failure
failed
deploy Deploy There is an unknown failure, please try again

* Try:
Run with --stacktrace option to get the stack trace. Run with --info or --debug option to get more log output. Run with --scan to get full insights.

* Get more help at https://help.gradle.org

BUILD FAILED in 23s
1 actionable task: 1 executed
ERROR: Job failed: exit code 1
failed
test Test There is an unknown failure, please try again

* Try:
Run with --stacktrace option to get the stack trace. Run with --info or --debug option to get more log output. Run with --scan to get full insights.

* Get more help at https://help.gradle.org

BUILD FAILED in 26s
1 actionable task: 1 executed
ERROR: Job failed: exit code 1
failed
build:jdk9 Build There has been a timeout failure or the job got stuck. Check your timeout limits or try again
No job log
failed
build:jdk10 Build There is an unknown failure, please try again

* Try:
Run with --stacktrace option to get the stack trace. Run with --info or --debug option to get more log output. Run with --scan to get full insights.

* Get more help at https://help.gradle.org

BUILD FAILED in 26s
1 actionable task: 1 executed
ERROR: Job failed: exit code 1