First part of fix for isDerivable

5 jobs for derivableBugFix in 3 minutes and 46 seconds (queued for 1 second)
Status Name Job ID Coverage
  Build
failed build:jdk10 #77100
allowed to fail

00:00:45

passed build:jdk8 #77101

00:01:13

failed build:jdk9 #77099
allowed to fail

00:00:55

 
  Test
failed test #77102
allowed to fail

00:00:32

 
  Deploy
failed deploy #77103
allowed to fail

00:00:19

 
Name Stage Failure
failed
deploy Deploy There is an unknown failure, please try again

* Try:
Run with --stacktrace option to get the stack trace. Run with --info or --debug option to get more log output. Run with --scan to get full insights.

* Get more help at https://help.gradle.org

BUILD FAILED in 8s
1 actionable task: 1 executed
ERROR: Job failed: exit code 1
failed
test Test There is an unknown failure, please try again

* Try:
Run with --stacktrace option to get the stack trace. Run with --info or --debug option to get more log output. Run with --scan to get full insights.

* Get more help at https://help.gradle.org

BUILD FAILED in 22s
1 actionable task: 1 executed
ERROR: Job failed: exit code 1
failed
build:jdk10 Build There is an unknown failure, please try again

* Try:
Run with --stacktrace option to get the stack trace. Run with --info or --debug option to get more log output. Run with --scan to get full insights.

* Get more help at https://help.gradle.org

BUILD FAILED in 28s
1 actionable task: 1 executed
ERROR: Job failed: exit code 1
failed
build:jdk9 Build There is an unknown failure, please try again

* Try:
Run with --stacktrace option to get the stack trace. Run with --info or --debug option to get more log output. Run with --scan to get full insights.

* Get more help at https://help.gradle.org

BUILD FAILED in 33s
1 actionable task: 1 executed
ERROR: Job failed: exit code 1