Merge remote-tracking branch 'remotes/origin/master' into luonng_variableAssignment

5 jobs for luonng_variableAssignment in 2 minutes and 41 seconds
Status Job ID Name Coverage
  Build
failed #77577
allowed to fail
build:jdk10

00:00:30

passed #77578
build:jdk8

00:00:59

failed #77576
allowed to fail
build:jdk9

00:00:32

 
  Test
failed #77579
allowed to fail
test

00:00:19

 
  Deploy
failed #77580
allowed to fail
deploy

00:00:20

 
Name Stage Failure
failed
deploy Deploy There is an unknown failure, please try again

* Try:
Run with --stacktrace option to get the stack trace. Run with --info or --debug option to get more log output. Run with --scan to get full insights.

* Get more help at https://help.gradle.org

BUILD FAILED in 10s
1 actionable task: 1 executed
ERROR: Job failed: exit code 1
failed
test Test There is an unknown failure, please try again

* Try:
Run with --stacktrace option to get the stack trace. Run with --info or --debug option to get more log output. Run with --scan to get full insights.

* Get more help at https://help.gradle.org

BUILD FAILED in 8s
1 actionable task: 1 executed
ERROR: Job failed: exit code 1
failed
build:jdk10 Build There is an unknown failure, please try again

* Try:
Run with --stacktrace option to get the stack trace. Run with --info or --debug option to get more log output. Run with --scan to get full insights.

* Get more help at https://help.gradle.org

BUILD FAILED in 21s
1 actionable task: 1 executed
ERROR: Job failed: exit code 1
failed
build:jdk9 Build There is an unknown failure, please try again

* Try:
Run with --stacktrace option to get the stack trace. Run with --info or --debug option to get more log output. Run with --scan to get full insights.

* Get more help at https://help.gradle.org

BUILD FAILED in 23s
1 actionable task: 1 executed
ERROR: Job failed: exit code 1