merge master into branch

5 jobs for luong_mastermerge in 2 minutes and 47 seconds (queued for 3 seconds)
latest
Status Job ID Name Coverage
  Build
failed #77582
allowed to fail
build:jdk10

00:00:31

passed #77583
build:jdk8

00:01:02

failed #77581
allowed to fail
build:jdk9

00:00:33

 
  Test
failed #77584
allowed to fail
test

00:00:21

 
  Deploy
failed #77585
allowed to fail
deploy

00:00:18

 
Name Stage Failure
failed
deploy Deploy There is an unknown failure, please try again

* Try:
Run with --stacktrace option to get the stack trace. Run with --info or --debug option to get more log output. Run with --scan to get full insights.

* Get more help at https://help.gradle.org

BUILD FAILED in 8s
1 actionable task: 1 executed
ERROR: Job failed: exit code 1
failed
test Test There is an unknown failure, please try again

* Try:
Run with --stacktrace option to get the stack trace. Run with --info or --debug option to get more log output. Run with --scan to get full insights.

* Get more help at https://help.gradle.org

BUILD FAILED in 10s
1 actionable task: 1 executed
ERROR: Job failed: exit code 1
failed
build:jdk10 Build There is an unknown failure, please try again

* Try:
Run with --stacktrace option to get the stack trace. Run with --info or --debug option to get more log output. Run with --scan to get full insights.

* Get more help at https://help.gradle.org

BUILD FAILED in 21s
1 actionable task: 1 executed
ERROR: Job failed: exit code 1
failed
build:jdk9 Build There is an unknown failure, please try again

* Try:
Run with --stacktrace option to get the stack trace. Run with --info or --debug option to get more log output. Run with --scan to get full insights.

* Get more help at https://help.gradle.org

BUILD FAILED in 23s
1 actionable task: 1 executed
ERROR: Job failed: exit code 1