Merge branch 'luong_mastermerge' into 'master'

Luong mastermerge

See merge request !21
5 jobs for master in 2 minutes and 53 seconds (queued for 2 seconds)
Status Name Job ID Coverage
  Build
failed build:jdk10 #78510
allowed to fail

00:00:32

passed build:jdk8 #78511

00:01:00

failed build:jdk9 #78509
allowed to fail

00:00:37

 
  Test
failed test #78512
allowed to fail

00:00:21

 
  Deploy
failed deploy #78513
allowed to fail

00:00:21

 
Name Stage Failure
failed
deploy Deploy There is an unknown failure, please try again

* Try:
Run with --stacktrace option to get the stack trace. Run with --info or --debug option to get more log output. Run with --scan to get full insights.

* Get more help at https://help.gradle.org

BUILD FAILED in 10s
1 actionable task: 1 executed
ERROR: Job failed: exit code 1
failed
test Test There is an unknown failure, please try again

* Try:
Run with --stacktrace option to get the stack trace. Run with --info or --debug option to get more log output. Run with --scan to get full insights.

* Get more help at https://help.gradle.org

BUILD FAILED in 10s
1 actionable task: 1 executed
ERROR: Job failed: exit code 1
failed
build:jdk10 Build There is an unknown failure, please try again

* Try:
Run with --stacktrace option to get the stack trace. Run with --info or --debug option to get more log output. Run with --scan to get full insights.

* Get more help at https://help.gradle.org

BUILD FAILED in 22s
1 actionable task: 1 executed
ERROR: Job failed: exit code 1
failed
build:jdk9 Build There is an unknown failure, please try again

* Try:
Run with --stacktrace option to get the stack trace. Run with --info or --debug option to get more log output. Run with --scan to get full insights.

* Get more help at https://help.gradle.org

BUILD FAILED in 27s
1 actionable task: 1 executed
ERROR: Job failed: exit code 1