bugfix filter inapplicable rules

5 jobs for master in 3 minutes and 29 seconds (queued for 2 seconds)
Status Job ID Name Coverage
  Build
failed #38821
allowed to fail
build:jdk10

00:00:37

passed #38822
build:jdk8

00:01:22

failed #38820
allowed to fail
build:jdk9

00:00:40

 
  Test
failed #38823
allowed to fail
test

00:00:23

 
  Deploy
failed #38824
allowed to fail
deploy

00:00:25

 
Name Stage Failure
failed
deploy Deploy There is an unknown failure, please try again

* Try:
Run with --stacktrace option to get the stack trace. Run with --info or --debug option to get more log output. Run with --scan to get full insights.

* Get more help at https://help.gradle.org

BUILD FAILED in 12s
1 actionable task: 1 executed
ERROR: Job failed: exit code 1
failed
test Test There is an unknown failure, please try again

* Try:
Run with --stacktrace option to get the stack trace. Run with --info or --debug option to get more log output. Run with --scan to get full insights.

* Get more help at https://help.gradle.org

BUILD FAILED in 12s
1 actionable task: 1 executed
ERROR: Job failed: exit code 1
failed
build:jdk10 Build There is an unknown failure, please try again

* Try:
Run with --stacktrace option to get the stack trace. Run with --info or --debug option to get more log output. Run with --scan to get full insights.

* Get more help at https://help.gradle.org

BUILD FAILED in 27s
1 actionable task: 1 executed
ERROR: Job failed: exit code 1
failed
build:jdk9 Build There is an unknown failure, please try again

* Try:
Run with --stacktrace option to get the stack trace. Run with --info or --debug option to get more log output. Run with --scan to get full insights.

* Get more help at https://help.gradle.org

BUILD FAILED in 30s
1 actionable task: 1 executed
ERROR: Job failed: exit code 1