Gutter

+ close KeY
+ SaveAsScript Dialog
+ pruning savepoint load
5 jobs for luong_workbranch in 3 minutes and 53 seconds (queued for 1 second)
Status Job ID Name Coverage
  Build
failed #39007
allowed to fail
build:jdk10

00:00:42

passed #39008
build:jdk8

00:01:21

failed #39006
allowed to fail
build:jdk9

00:00:45

 
  Test
failed #39009
allowed to fail
test

00:00:39

 
  Deploy
failed #39010
allowed to fail
deploy

00:00:24

 
Name Stage Failure
failed
deploy Deploy There is an unknown failure, please try again

* Try:
Run with --stacktrace option to get the stack trace. Run with --info or --debug option to get more log output. Run with --scan to get full insights.

* Get more help at https://help.gradle.org

BUILD FAILED in 12s
1 actionable task: 1 executed
ERROR: Job failed: exit code 1
failed
test Test There is an unknown failure, please try again

* Try:
Run with --stacktrace option to get the stack trace. Run with --info or --debug option to get more log output. Run with --scan to get full insights.

* Get more help at https://help.gradle.org

BUILD FAILED in 28s1 actionable task: 1 executed

ERROR: Job failed: exit code 1
failed
build:jdk10 Build There is an unknown failure, please try again

* Try:
Run with --stacktrace option to get the stack trace. Run with --info or --debug option to get more log output. Run with --scan to get full insights.

* Get more help at https://help.gradle.org

BUILD FAILED in 30s
1 actionable task: 1 executed
ERROR: Job failed: exit code 1
failed
build:jdk9 Build There is an unknown failure, please try again

* Try:
Run with --stacktrace option to get the stack trace. Run with --info or --debug option to get more log output. Run with --scan to get full insights.

* Get more help at https://help.gradle.org

BUILD FAILED in 33s
1 actionable task: 1 executed
ERROR: Job failed: exit code 1