Tree now expandable and collapsable, treecells need to be reworked

5 jobs for master in 2 minutes and 37 seconds (queued for 1 second)
Status Job ID Name Coverage
  Build
failed #44374
allowed to fail
build:jdk10

00:00:30

passed #44375
build:jdk8

00:00:55

failed #44373
allowed to fail
build:jdk9

00:00:36

 
  Test
failed #44376
allowed to fail
test

00:00:17

 
  Deploy
failed #44377
allowed to fail
deploy

00:00:17

 
Name Stage Failure
failed
deploy Deploy There is an unknown failure, please try again

* Try:
Run with --stacktrace option to get the stack trace. Run with --info or --debug option to get more log output. Run with --scan to get full insights.

* Get more help at https://help.gradle.org

BUILD FAILED in 8s
1 actionable task: 1 executed
ERROR: Job failed: exit code 1
failed
test Test There is an unknown failure, please try again

* Try:
Run with --stacktrace option to get the stack trace. Run with --info or --debug option to get more log output. Run with --scan to get full insights.

* Get more help at https://help.gradle.org

BUILD FAILED in 8s
1 actionable task: 1 executed
ERROR: Job failed: exit code 1
failed
build:jdk10 Build There is an unknown failure, please try again

* Try:
Run with --stacktrace option to get the stack trace. Run with --info or --debug option to get more log output. Run with --scan to get full insights.

* Get more help at https://help.gradle.org

BUILD FAILED in 20s
1 actionable task: 1 executed
ERROR: Job failed: exit code 1
failed
build:jdk9 Build There is an unknown failure, please try again

* Try:
Run with --stacktrace option to get the stack trace. Run with --info or --debug option to get more log output. Run with --scan to get full insights.

* Get more help at https://help.gradle.org

BUILD FAILED in 26s
1 actionable task: 1 executed
ERROR: Job failed: exit code 1