Bugfixes made:

- script execution not considering multiple goals - userinformation added
- Execution Marker removed
- new java problem loadable after one was already loaded
- java problem -> reload -> execute script throws ex "could not clear env exeption" -> but still works
6 jobs for luong_mastermerge in 113 minutes and 16 seconds
Status Job ID Name Coverage
  Build
failed #65077
allowed to fail
build:jdk10

00:00:39

passed #65078
build:jdk8

00:01:04

failed #65076
allowed to fail
build:jdk9

01:52:21

 
  Test
failed #67414
allowed to fail
test

00:00:35

failed #65079
allowed to fail
test

00:00:35

 
  Deploy
failed #65080
allowed to fail
deploy

00:00:19

 
Name Stage Failure
failed
test Test There is an unknown failure, please try again

* Try:
Run with --stacktrace option to get the stack trace. Run with --info or --debug option to get more log output. Run with --scan to get full insights.

* Get more help at https://help.gradle.org

BUILD FAILED in 26s
1 actionable task: 1 executed
ERROR: Job failed: exit code 1
failed
deploy Deploy There is an unknown failure, please try again

* Try:
Run with --stacktrace option to get the stack trace. Run with --info or --debug option to get more log output. Run with --scan to get full insights.

* Get more help at https://help.gradle.org

BUILD FAILED in 9s
1 actionable task: 1 executed
ERROR: Job failed: exit code 1
failed
build:jdk9 Build There has been a timeout failure or the job got stuck. Check your timeout limits or try again
No job log
failed
build:jdk10 Build There is an unknown failure, please try again

* Try:
Run with --stacktrace option to get the stack trace. Run with --info or --debug option to get more log output. Run with --scan to get full insights.

* Get more help at https://help.gradle.org

BUILD FAILED in 29s
1 actionable task: 1 executed
ERROR: Job failed: exit code 1