Bugfix: DerivableCase

5 jobs for derivableBugFix in 2 minutes and 43 seconds (queued for 3 seconds)
latest
Status Job ID Name Coverage
  Build
failed #78688
allowed to fail
build:jdk10

00:00:31

passed #78689
build:jdk8

00:01:00

failed #78687
allowed to fail
build:jdk9

00:00:33

 
  Test
failed #78690
allowed to fail
test

00:00:18

 
  Deploy
failed #78691
allowed to fail
deploy

00:00:19

 
Name Stage Failure
failed
deploy Deploy There is an unknown failure, please try again

* Try:
Run with --stacktrace option to get the stack trace. Run with --info or --debug option to get more log output. Run with --scan to get full insights.

* Get more help at https://help.gradle.org

BUILD FAILED in 9s
1 actionable task: 1 executed
ERROR: Job failed: exit code 1
failed
test Test There is an unknown failure, please try again

* Try:
Run with --stacktrace option to get the stack trace. Run with --info or --debug option to get more log output. Run with --scan to get full insights.

* Get more help at https://help.gradle.org

BUILD FAILED in 8s
1 actionable task: 1 executed
ERROR: Job failed: exit code 1
failed
build:jdk10 Build There is an unknown failure, please try again

* Try:
Run with --stacktrace option to get the stack trace. Run with --info or --debug option to get more log output. Run with --scan to get full insights.

* Get more help at https://help.gradle.org

BUILD FAILED in 21s
1 actionable task: 1 executed
ERROR: Job failed: exit code 1
failed
build:jdk9 Build There is an unknown failure, please try again

* Try:
Run with --stacktrace option to get the stack trace. Run with --info or --debug option to get more log output. Run with --scan to get full insights.

* Get more help at https://help.gradle.org

BUILD FAILED in 24s
1 actionable task: 1 executed
ERROR: Job failed: exit code 1